position,composer,work,performer,date-display,catalogue,matrix-num,cat-num,venue,label,producer-engineer,page,volume,sound-file,
"1","BACH, J.S.","Courante","Walker W. Hedcock, organ","1926-08-16","gray ","WAX 1837","UNISSUED",,"Columbia",,,,,
"2","BACH, J.S.","Minuet","Walker W. Hedcock, organ","1926-08-16","gray ","WAX 1838","UNISSUED",,"Columbia",,,,,
"3","SCHUMANN","Traumerei","Walker W. Hedcock, organ","1926-08-16","gray ","WAX 1839","UNISSUED",,"Columbia",,,,,
"4","SCHUMANN",,"Walker W. Hedcock, organ","1926-08-16","gray ","WAX 1841","UNISSUED",,"Columbia",,,,,
"5","WAGNER","Tannhäuser - Pilgrim's march","Walker W. Hedcock, organ","1926-08-16","gray ","WAX 1842","UNISSUED",,"Columbia",,,,,
"6","BACH, J.S.","Courante","Walker W. Hedcock, organ","1926-08-20","gray ","WAX 1850","UNISSUED",,"Columbia",,,,,
"7","BACH, J.S.","Minuet","Walker W. Hedcock, organ","1926-08-20","gray ","WAX 1851","UNISSUED",,"Columbia",,,,,
"8","SCHUMANN","Traumerei","Walker W. Hedcock, organ","1926-08-20","gray ","WAX 1852","UNISSUED",,"Columbia",,,,,
"9","WAGNER","Tannhäuser - Pilgrim's march","Walker W. Hedcock, organ","1926-09-01","gray ","WAX 1865","UNISSUED","Duke's Hotel","Columbia",,,,,
"10",,,"Crystal Palace","1926-08-10","gray ","WAX 1813","UNISSUED",,"Columbia",,,,,
"11",,,"Crystal Palace","1926-08-10","gray ","WAX 1814","UNISSUED",,"Columbia",,,,,
"12",,,"Crystal Palace","1926-08-10","gray ","WAX 1815","UNISSUED",,"Columbia",,,,,
"13",,,"Crystal Palace","1926-08-10","gray ","WAX 1816","UNISSUED",,"Columbia",,,,,
"14",,,"Crystal Palace","1926-08-10","gray ","WAX 1817","UNISSUED",,"Columbia",,,,,
"15",,,"Crystal Palace","1926-08-10","gray ","WAX 1818","UNISSUED",,"Columbia",,,,,
